Target
Glycogen phosphorylase, muscle form
Ligand
BDBM50056264
Substrate
Meas. Tech.
ChEMBL_1449753 (CHEMBL3378176)
Ki
56000±n/a nM
Citation
 Parmenopoulou, VKantsadi, ALTsirkone, VGChatzileontiadou, DSManta, SZographos, SEMolfeta, CArchontis, GAgius, LHayes, JMLeonidas, DDKomiotis, D Structure based inhibitor design targeting glycogen phosphorylase B. Virtual screening, synthesis, biochemical and biological assessment of novel N-acyl-ß-d-glucopyranosylamines. Bioorg Med Chem 22:4810-25 (2014)  
Target
Name:
Glycogen phosphorylase, muscle form
Synonyms:
Glycogen Phosphorylase (PYGM) Glycogen phosphorylase, muscle form PYGM | PYGM_RABIT
Type:
Enzyme
Mol. Mass.:
97296.32
Organism:
Oryctolagus cuniculus (rabbit)
Description:
Phosphorylation of Ser-15 converts phosphorylase B (unphosphorylated) to phosphorylase A.
Residue:
843
  
Inhibitor
Name:
BDBM50056264
Synonyms:
CHEMBL1229682
Type:
Small organic molecule
Emp. Form.:
C18H20N2O7
Mol. Mass.:
376.3606
SMILES:
OC[C@H]1O[C@@H](NC(=O)C(=O)Nc2ccc3ccccc3c2)[C@H](O)[C@@H](O)[C@@H]1O
: