Target
Glycogen phosphorylase, muscle form
Ligand
BDBM50240801
Substrate
Meas. Tech.
ChEMBL_1449753 (CHEMBL3378176)
Ki
81000±n/a nM
Citation
 Parmenopoulou, VKantsadi, ALTsirkone, VGChatzileontiadou, DSManta, SZographos, SEMolfeta, CArchontis, GAgius, LHayes, JMLeonidas, DDKomiotis, D Structure based inhibitor design targeting glycogen phosphorylase B. Virtual screening, synthesis, biochemical and biological assessment of novel N-acyl-ß-d-glucopyranosylamines. Bioorg Med Chem 22:4810-25 (2014)  
Target
Name:
Glycogen phosphorylase, muscle form
Synonyms:
Glycogen Phosphorylase (PYGM) Glycogen phosphorylase, muscle form PYGM | PYGM_RABIT
Type:
Enzyme
Mol. Mass.:
97296.32
Organism:
Oryctolagus cuniculus (rabbit)
Description:
Phosphorylation of Ser-15 converts phosphorylase B (unphosphorylated) to phosphorylase A.
Residue:
843
  
Inhibitor
Name:
BDBM50240801
Synonyms:
CHEMBL131967 N-((2R,3R,4S,5S,6R)-3,4,5-trihydroxy-6-(hydroxymethyl)tetrahydro-2H-pyran-2-yl)benzamide N-(phenylcarbonyl)-beta-D-glucopyranosylamine
Type:
Small organic molecule
Emp. Form.:
C13H17NO6
Mol. Mass.:
283.2772
SMILES:
OC[C@H]1O[C@@H](NC(=O)c2ccccc2)[C@H](O)[C@@H](O)[C@@H]1O
: