Target
Lysophosphatidic acid receptor 3
Ligand
BDBM50056345
Substrate
Meas. Tech.
ChEMBL_1451396 (CHEMBL3363956)
IC50
6600±n/a nM
Citation
 Patil, RFells, JISzabó, ELim, KGNorman, DDBalogh, APatil, SStrobos, JMiller, DDTigyi, GJ Design and synthesis of sulfamoyl benzoic acid analogues with subnanomolar agonist activity specific to the LPA2 receptor. J Med Chem 57:7136-40 (2014)  
Target
Name:
Lysophosphatidic acid receptor 3
Synonyms:
EDG7 LPAR3 Lysophosphatidic acid receptor 1/3 Lysophosphatidic acid receptor Edg-7
Type:
Enzyme
Mol. Mass.:
40149.72
Organism:
Homo sapiens (Human)
Description:
Q9UBY5
Residue:
353
  
Inhibitor
Name:
BDBM50056345
Synonyms:
CHEMBL3322500
Type:
Small organic molecule
Emp. Form.:
C22H17NO4S
Mol. Mass.:
391.44
SMILES:
OC(=O)c1ccccc1SCCCN1C(=O)c2cccc3cccc(C1=O)c23
: