Target
Lysophosphatidic acid receptor 2
Ligand
BDBM50056347
Substrate
Meas. Tech.
ChEMBL_1451385 (CHEMBL3363669)
EC50
110±n/a nM
Citation
 Patil, RFells, JISzabó, ELim, KGNorman, DDBalogh, APatil, SStrobos, JMiller, DDTigyi, GJ Design and synthesis of sulfamoyl benzoic acid analogues with subnanomolar agonist activity specific to the LPA2 receptor. J Med Chem 57:7136-40 (2014)  
Target
Name:
Lysophosphatidic acid receptor 2
Synonyms:
EDG4 LPA-2 LPAR2 Lysophosphatidic acid receptor 2 | Lysophosphatidic acid receptor Edg-4
Type:
PROTEIN
Mol. Mass.:
39103.44
Organism:
Homo sapiens (Human)
Description:
ChEMBL_1451385
Residue:
351
  
Inhibitor
Name:
BDBM50056347
Synonyms:
CHEMBL3322502
Type:
Small organic molecule
Emp. Form.:
C23H20N2O6S
Mol. Mass.:
452.48
SMILES:
OC(=O)c1ccccc1S(=O)(=O)NCCCCN1C(=O)c2cccc3cccc(C1=O)c23
: