Target
Carbonic anhydrase 12
Ligand
BDBM50059078
Substrate
Meas. Tech.
ChEMBL_1456927 (CHEMBL3368144)
Ki
1.9±n/a nM
Citation
 Pala, NMicheletto, LSechi, MAggarwal, MCarta, FMcKenna, RSupuran, CT Carbonic Anhydrase Inhibition with Benzenesulfonamides and Tetrafluorobenzenesulfonamides Obtained via Click Chemistry. ACS Med Chem Lett 5:927-30 (2014)  
Target
Name:
Carbonic anhydrase 12
Synonyms:
CA-XII CAH12_HUMAN Carbonic anhydrase Carbonic anhydrase XII Carbonic anhydrase XII (CAXII) | Tumor antigen HOM-RCC-3.1.3
Type:
Enzyme
Mol. Mass.:
39456.00
Organism:
Homo sapiens (Human)
Description:
Catalytic domain of human cloned isozyme was used in the assay
Residue:
354
  
Inhibitor
Name:
BDBM50059078
Synonyms:
CHEMBL3326407
Type:
Small organic molecule
Emp. Form.:
C14H19N5O4S
Mol. Mass.:
353.397
SMILES:
CC(C)(C)OC(=O)NCc1cn(nn1)-c1ccc(cc1)S(N)(=O)=O
: