Target
Carbonic anhydrase 2
Ligand
BDBM50058939
Substrate
Meas. Tech.
ChEMBL_1456925 (CHEMBL3368142)
Ki
27±n/a nM
Citation
 Pala, NMicheletto, LSechi, MAggarwal, MCarta, FMcKenna, RSupuran, CT Carbonic Anhydrase Inhibition with Benzenesulfonamides and Tetrafluorobenzenesulfonamides Obtained via Click Chemistry. ACS Med Chem Lett 5:927-30 (2014)  
Target
Name:
Carbonic anhydrase 2
Synonyms:
CA-II CAC Carbonate dehydratase II Carbonic anhydrase 2 (CA-II) Carbonic anhydrase C Carbonic anhydrase II (CA-II) Carbonic anhydrase II (hCA II) | Carbonic anhydrase isoenzyme II (hCA II)
Type:
Enzyme
Mol. Mass.:
29250.71
Organism:
Homo sapiens (Human)
Description:
P00918
Residue:
260
  
Inhibitor
Name:
BDBM50058939
Synonyms:
CHEMBL3326418
Type:
Small organic molecule
Emp. Form.:
C14H15F4N5O4S
Mol. Mass.:
425.359
SMILES:
CC(C)(C)OC(=O)NCc1cn(nn1)-c1c(F)c(F)c(c(F)c1F)S(N)(=O)=O
: