Target
Carbonic anhydrase 9
Ligand
BDBM50262062
Substrate
Meas. Tech.
ChEMBL_1456926 (CHEMBL3368143)
Ki
26±n/a nM
Citation
 Pala, NMicheletto, LSechi, MAggarwal, MCarta, FMcKenna, RSupuran, CT Carbonic Anhydrase Inhibition with Benzenesulfonamides and Tetrafluorobenzenesulfonamides Obtained via Click Chemistry. ACS Med Chem Lett 5:927-30 (2014)  
Target
Name:
Carbonic anhydrase 9
Synonyms:
CA-IX CAH9_HUMAN Carbonic anhydrase 9 (CA IX) Carbonic anhydrase 9 precursor Carbonic anhydrase IX (CAIX) Carbonic anhydrases; II & IX MN RCC-associated antigen G250
Type:
Enzyme
Mol. Mass.:
49669.03
Organism:
Homo sapiens (Human)
Description:
Catalytic domain of human cloned isozyme was used in the assay
Residue:
459
  
Inhibitor
Name:
BDBM50262062
Synonyms:
4-(4-phenyl-1H-1,2,3-triazol-1-yl)benzenesulfonamide | CHEMBL513184
Type:
Small organic molecule
Emp. Form.:
C14H12N4O2S
Mol. Mass.:
300.336
SMILES:
NS(=O)(=O)c1ccc(cc1)-n1cc(nn1)-c1ccccc1
: