Target
Carbonic anhydrase 9
Ligand
BDBM50059074
Substrate
Meas. Tech.
ChEMBL_1456926 (CHEMBL3368143)
Ki
6.9±n/a nM
Citation
 Pala, NMicheletto, LSechi, MAggarwal, MCarta, FMcKenna, RSupuran, CT Carbonic Anhydrase Inhibition with Benzenesulfonamides and Tetrafluorobenzenesulfonamides Obtained via Click Chemistry. ACS Med Chem Lett 5:927-30 (2014)  
Target
Name:
Carbonic anhydrase 9
Synonyms:
CA-IX CAH9_HUMAN Carbonic anhydrase 9 (CA IX) Carbonic anhydrase 9 precursor Carbonic anhydrase IX (CAIX) Carbonic anhydrases; II & IX MN RCC-associated antigen G250
Type:
Enzyme
Mol. Mass.:
49669.03
Organism:
Homo sapiens (Human)
Description:
Catalytic domain of human cloned isozyme was used in the assay
Residue:
459
  
Inhibitor
Name:
BDBM50059074
Synonyms:
CHEMBL3326403
Type:
Small organic molecule
Emp. Form.:
C10H11BrN4O2S
Mol. Mass.:
331.189
SMILES:
NS(=O)(=O)c1ccc(cc1)-n1cc(CCBr)nn1
: