Target
Mitogen-activated protein kinase kinase kinase 9
Ligand
BDBM50059190
Substrate
Meas. Tech.
ChEMBL_1460563 (CHEMBL3395595)
IC50
68±n/a nM
Citation
 Patel, SCohen, FDean, BJDe La Torre, KDeshmukh, GEstrada, AAGhosh, ASGibbons, PGustafson, AHuestis, MPLe Pichon, CELin, HLiu, WLiu, XLiu, YLy, CQLyssikatos, JPMa, CScearce-Levie, KShin, YGSolanoy, HStark, KLWang, JWang, BZhao, XLewcock, JWSiu, M Discovery of dual leucine zipper kinase (DLK, MAP3K12) inhibitors with activity in neurodegeneration models. J Med Chem 58:401-18 (2015)  
Target
Name:
Mitogen-activated protein kinase kinase kinase 9
Synonyms:
M3K9_HUMAN MLK1 Mitogen-activated protein kinase kinase kinase 9 (MLK1) PRKE1
Type:
protein
Mol. Mass.:
121881.51
Organism:
Homo sapiens (Human)
Description:
P80192
Residue:
1104
  
Inhibitor
Name:
BDBM50059190
Synonyms:
CHEMBL3393333
Type:
Small organic molecule
Emp. Form.:
C23H26F2N6O
Mol. Mass.:
440.4889
SMILES:
FC1(F)CCN(C1)c1cc(cc(Nc2cc(ccn2)C#N)n1)C1CCN(CC1)C1COC1
: