Target
D(3) dopamine receptor
Ligand
BDBM50036734
Substrate
Meas. Tech.
ChEMBL_1460712 (CHEMBL3396043)
Ki
353±n/a nM
Citation
 Sozio, PFiorito, JDi Giacomo, VDi Stefano, AMarinelli, LCacciatore, ICataldi, APacella, STurkez, HParenti, CRescifina, AMarrazzo, A Haloperidol metabolite II prodrug: asymmetric synthesis and biological evaluation on rat C6 glioma cells. Eur J Med Chem 90:1-9 (2015)  
Target
Name:
D(3) dopamine receptor
Synonyms:
DOPAMINE D3 Dopamine D3 receptor | Drd3
Type:
Protein
Mol. Mass.:
49540.58
Organism:
Rattus norvegicus (Rat)
Description:
P19020
Residue:
446
  
Inhibitor
Name:
BDBM50036734
Synonyms:
(S)-4-(4-Chloro-phenyl)-1-[4-(4-fluoro-phenyl)-4-hydroxy-butyl]-piperidin-4-ol | CHEMBL129237
Type:
Small organic molecule
Emp. Form.:
C21H25ClFNO2
Mol. Mass.:
377.88
SMILES:
O[C@@H](CCCN1CCC(O)(CC1)c1ccc(Cl)cc1)c1ccc(F)cc1
: