Target
Sigma non-opioid intracellular receptor 1
Ligand
BDBM50009307
Substrate
Meas. Tech.
ChEMBL_1460710 (CHEMBL3396041)
Ki
70±n/a nM
Citation
 Sozio, PFiorito, JDi Giacomo, VDi Stefano, AMarinelli, LCacciatore, ICataldi, APacella, STurkez, HParenti, CRescifina, AMarrazzo, A Haloperidol metabolite II prodrug: asymmetric synthesis and biological evaluation on rat C6 glioma cells. Eur J Med Chem 90:1-9 (2015)  
Target
Name:
Sigma non-opioid intracellular receptor 1
Synonyms:
OPRS1 SIGMAR1 Sigma non-opioid intracellular receptor 1 Sigma1-receptor Sterol isomerase-like protein
Type:
Protein
Mol. Mass.:
25307.17
Organism:
Cavia porcellus (Guinea pig)
Description:
Q60492
Residue:
223
  
Inhibitor
Name:
BDBM50009307
Synonyms:
DITOLYLGUANIDINE | Di-o-tolylguanidine
Type:
Small organic molecule
Emp. Form.:
C15H17N3
Mol. Mass.:
239.3156
SMILES:
Cc1ccccc1NC(=N)Nc1ccccc1C
: