Target
Orexin receptor type 2
Ligand
BDBM104692
Substrate
Meas. Tech.
ChEMBL_1462305 (CHEMBL3395398)
Ki
0.300000±n/a nM
Citation
 Raheem, ITBreslin, MJBruno, JCabalu, TDCooke, ACox, CDCui, DGarson, SGotter, ALFox, SVHarrell, CMKuduk, SDLemaire, WPrueksaritanont, TRenger, JJStump, CTannenbaum, PLWilliams, PDWinrow, CJColeman, PJ Discovery of piperidine ethers as selective orexin receptor antagonists (SORAs) inspired by filorexant. Bioorg Med Chem Lett 25:444-50 (2015)  
Target
Name:
Orexin receptor type 2
Synonyms:
HCRTR2 OX2R_HUMAN Orexin receptor type 2 (OR-2) Orexin receptor type 2 (OX2R) Ox-2-R | Ox2-R
Type:
Protein
Mol. Mass.:
50710.53
Organism:
Homo sapiens (Human)
Description:
O43614
Residue:
444
  
Inhibitor
Name:
BDBM104692
Synonyms:
US8569311, E-5
Type:
Small organic molecule
Emp. Form.:
C24H25FN4O2
Mol. Mass.:
420.4793
SMILES:
C[C@@H]1CC[C@@H](COc2ccc(F)cn2)CN1C(=O)c1cc(C)ccc1-c1ncccn1
: