Target
Histone-lysine N-methyltransferase SETDB1
Ligand
BDBM50009672
Substrate
Meas. Tech.
ChEMBL_1463677 (CHEMBL3399136)
IC50
2200±n/a nM
Citation
 Kung, PPHuang, BZehnder, LTatlock, JBingham, PKrivacic, CGajiwala, KDiehl, WYu, XMaegley, KA SAH derived potent and selective EZH2 inhibitors. Bioorg Med Chem Lett 25:1532-7 (2015)  
Target
Name:
Histone-lysine N-methyltransferase SETDB1
Synonyms:
ERG-associated protein with SET domain H3-K9-HMTase 4 KIAA0067 Lysine N-methyltransferase 1E SETB1_HUMAN | SETDB1
Type:
Enzyme
Mol. Mass.:
143146.23
Organism:
Homo sapiens (Human)
Description:
Q15047
Residue:
1291
  
Inhibitor
Name:
BDBM50009672
Synonyms:
AdoHcy S-(5'-adenosyl)-L-homocysteine S-[1-(adenin-9-yl)-1,5-dideoxy-beta-D-ribofuranos-5-yl]-L-homocysteine SAH US9175331, 1 | US9333217, S-Adenosyl-L-homocysteine (SAH)
Type:
Small organic molecule
Emp. Form.:
C14H20N6O5S
Mol. Mass.:
384.411
SMILES:
N[C@@H](CCSC[C@H]1O[C@H]([C@H](O)[C@@H]1O)n1cnc2c(N)ncnc12)C(O)=O
: