Target
Oligo-1,6-glucosidase IMA1
Ligand
BDBM50063774
Substrate
Meas. Tech.
ChEMBL_1463722 (CHEMBL3399253)
IC50
42900±n/a nM
Citation
 Han, KLi, YZhang, YTeng, YMa, YWang, MWang, RXu, WYao, QZhang, YQin, HSun, HYu, P Design, synthesis and docking study of novel tetracyclic oxindole derivatives asa-glucosidase inhibitors. Bioorg Med Chem Lett 25:1471-5 (2015)  
Target
Name:
Oligo-1,6-glucosidase IMA1
Synonyms:
α-glucosidase Alpha-glucosidase (α-glucosidase) MALX3_YEAST | Oligo-1,6-glucosidase
Type:
Protein
Mol. Mass.:
68577.59
Organism:
Saccharomyces cerevisiae S288c (Baker's yeast)
Description:
Residue:
589
  
Inhibitor
Name:
BDBM50063774
Synonyms:
CHEMBL3397473
Type:
Small organic molecule
Emp. Form.:
C25H19FN2O6S
Mol. Mass.:
494.492
SMILES:
COC(=O)CC1N(c2ccccc2-c2ccc3N(C)C(=O)C(=O)c3c12)S(=O)(=O)c1ccc(F)cc1
: