Target
Cannabinoid receptor 1
Ligand
BDBM50006232
Substrate
Meas. Tech.
ChEMBL_1464105 (CHEMBL3406631)
EC50
1400±n/a nM
Citation
 Hickey, ERZindell, RCirillo, PFWu, LErmann, MBerry, AKThomson, DSAlbrecht, CGemkow, MJRiether, D Selective CB2 receptor agonists. Part 1: the identification of novel ligands through computer-aided drug design (CADD) approaches. Bioorg Med Chem Lett 25:575-80 (2015)  
Target
Name:
Cannabinoid receptor 1
Synonyms:
CANN6 CB-R CNR CNR1_HUMAN Cannabinoid receptor Cannabinoid receptor 1 (brain)
Type:
G Protein-Coupled Receptor (GPCR)
Mol. Mass.:
52868.96
Organism:
Homo sapiens (Human)
Description:
P21554
Residue:
472
  
Inhibitor
Name:
BDBM50006232
Synonyms:
CHEMBL3235058
Type:
Small organic molecule
Emp. Form.:
C17H19F3N4O2
Mol. Mass.:
368.3536
SMILES:
CC(C)(C)c1cc(NC(=O)[C@@H]2CCN2c2ccc(cn2)C(F)(F)F)no1
: