Target
Oxysterols receptor LXR-alpha
Ligand
BDBM19992
Substrate
Meas. Tech.
ChEMBL_1464816 (CHEMBL3404171)
EC50
1300±n/a nM
Citation
 Matsuda, TOkuda, AWatanabe, YMiura, TOzawa, HTosaka, AYamazaki, KYamaguchi, YKurobuchi, SKoura, MShibuya, K Design and discovery of 2-oxochromene derivatives as liver X receptorß-selective agonists. Bioorg Med Chem Lett 25:1274-8 (2015)  
Target
Name:
Oxysterols receptor LXR-alpha
Synonyms:
LXRA Liver X receptor alpha Liver X receptor alpha (NR1H3) NR1H3 Nuclear orphan receptor LXR-alpha | Nuclear receptor subfamily 1 group H member 3
Type:
Enzyme Catalytic Domain
Mol. Mass.:
50403.85
Organism:
Homo sapiens (Human)
Description:
Q13133
Residue:
447
  
Inhibitor
Name:
BDBM19992
Synonyms:
2-[3-[3-[[2-chloro-3-(trifluoromethyl)phenyl]methyl-[2,2-di(phenyl)ethyl]amino]propoxy]phenyl]acetic acid CHEMBL59030 GW3965 US10669296, Compound GW3965 | US10945978, Compound 2
Type:
Small organic molecule
Emp. Form.:
C33H31ClF3NO3
Mol. Mass.:
582.052
SMILES:
OC(=O)Cc1cccc(OCCCN(CC(c2ccccc2)c2ccccc2)Cc2cccc(c2Cl)C(F)(F)F)c1
: