Target
Carbonic anhydrase 12
Ligand
BDBM50066130
Substrate
Meas. Tech.
ChEMBL_1465103 (CHEMBL3405435)
Ki
11±n/a nM
Citation
 Carta, FDi Cesare Mannelli, LPinard, MGhelardini, CScozzafava, AMcKenna, RSupuran, CT A class of sulfonamide carbonic anhydrase inhibitors with neuropathic pain modulating effects. Bioorg Med Chem 23:1828-40 (2015)  
Target
Name:
Carbonic anhydrase 12
Synonyms:
CA-XII CAH12_HUMAN Carbonic anhydrase Carbonic anhydrase XII Carbonic anhydrase XII (CAXII) | Tumor antigen HOM-RCC-3.1.3
Type:
Enzyme
Mol. Mass.:
39456.00
Organism:
Homo sapiens (Human)
Description:
Catalytic domain of human cloned isozyme was used in the assay
Residue:
354
  
Inhibitor
Name:
BDBM50066130
Synonyms:
CHEMBL3402962
Type:
Small organic molecule
Emp. Form.:
C13H13NO3S
Mol. Mass.:
263.312
SMILES:
NS(=O)(=O)c1ccc(OCc2ccccc2)cc1
: