Target
Carbonic anhydrase 2
Ligand
BDBM50427223
Substrate
Meas. Tech.
ChEMBL_1465409 (CHEMBL3407117)
Ki
54±n/a nM
Citation
 Vullo, DDe Luca, VDel Prete, SCarginale, VScozzafava, ACapasso, CSupuran, CT Sulfonamide inhibition studies of theż-carbonic anhydrase from the Antarctic cyanobacterium Nostoc commune. Bioorg Med Chem 23:1728-34 (2015)  
Target
Name:
Carbonic anhydrase 2
Synonyms:
CA-II CAC Carbonate dehydratase II Carbonic anhydrase 2 (CA-II) Carbonic anhydrase C Carbonic anhydrase II (CA-II) Carbonic anhydrase II (hCA II) | Carbonic anhydrase isoenzyme II (hCA II)
Type:
Enzyme
Mol. Mass.:
29250.71
Organism:
Homo sapiens (Human)
Description:
P00918
Residue:
260
  
Inhibitor
Name:
BDBM50427223
Synonyms:
CHEMBL2324869
Type:
Small organic molecule
Emp. Form.:
C6H5Cl2NO3S
Mol. Mass.:
242.08
SMILES:
NS(=O)(=O)c1cc(Cl)cc(Cl)c1O
: