Target
Alpha-1B adrenergic receptor
Ligand
BDBM50067212
Substrate
Meas. Tech.
ChEMBL_1464291 (CHEMBL3404320)
EC50
5.9±n/a nM
Citation
 Zareba, PDudek, MLustyk, KSiwek, AStarowicz, GBednarski, MNowinski, LRazny, KSapa, JMalawska, BKulig, K a-Adrenoceptor antagonistic and hypotensive properties of novel arylpiperazine derivatives of pyrrolidin-2-one. Bioorg Med Chem 23:2104-11 (2015)  
Target
Name:
Alpha-1B adrenergic receptor
Synonyms:
ADA1B_HUMAN Adrenergic alpha1B Adrenergic receptor alpha Alpha 1B-adrenoreceptor | Alpha-1B adrenergic receptor
Type:
Enzyme
Mol. Mass.:
56862.13
Organism:
Homo sapiens (Human)
Description:
P35368
Residue:
520
  
Inhibitor
Name:
BDBM50067212
Synonyms:
CHEBI:8093 Duo-Medihaler | Phenylephrine
Type:
Small organic molecule
Emp. Form.:
C9H13NO2
Mol. Mass.:
167.205
SMILES:
CNC[C@H](O)c1cccc(O)c1
: