Target
Bifunctional epoxide hydrolase 2
Ligand
BDBM50027018
Substrate
Meas. Tech.
ChEMBL_1464036 (CHEMBL3406221)
IC50
1200000±n/a nM
Citation
 Amano, YTanabe, EYamaguchi, T Identification of N-ethylmethylamine as a novel scaffold for inhibitors of soluble epoxide hydrolase by crystallographic fragment screening. Bioorg Med Chem 23:2310-7 (2015)  
Target
Name:
Bifunctional epoxide hydrolase 2
Synonyms:
Cytosolic epoxide hydrolase 2 EPHX2 HYES_HUMAN Soluble epoxide hydrolase (sEH) | epoxide hydrolase 2, cytoplasmic
Type:
Enzyme
Mol. Mass.:
62613.07
Organism:
Homo sapiens (Human)
Description:
P34913
Residue:
555
  
Inhibitor
Name:
BDBM50027018
Synonyms:
1-(3-Trifluoromethyl-pyridin-2-yl)-piperazine | CHEMBL45663
Type:
Small organic molecule
Emp. Form.:
C10H12F3N3
Mol. Mass.:
231.2176
SMILES:
FC(F)(F)c1cccnc1N1CCNCC1
: