Target
Intestinal-type alkaline phosphatase
Ligand
BDBM18073
Substrate
Meas. Tech.
ChEMBL_1464325 (CHEMBL3404592)
IC50
80210±n/a nM
Citation
 Al-Rashida, MEjaz, SAAli, SShaukat, AHamayoun, MAhmed, MIqbal, J Diarylsulfonamides and their bioisosteres as dual inhibitors of alkaline phosphatase and carbonic anhydrase: Structure activity relationship and molecular modelling studies. Bioorg Med Chem 23:2435-44 (2015)  
Target
Name:
Intestinal-type alkaline phosphatase
Synonyms:
ALPI Intestinal alkaline phosphatase (IAP) PPBI_BOVIN
Type:
Protein
Mol. Mass.:
57094.82
Organism:
Bos taurus (Cattle)
Description:
P19111
Residue:
533
  
Inhibitor
Name:
BDBM18073
Synonyms:
(2S)-2-amino-3-phenylpropanoic acid L-[2,3,4,5,6-3H]phenylalanine Phenylalanine | US11021454, Compound L-phe
Type:
Amino Acid
Emp. Form.:
C9H11NO2
Mol. Mass.:
165.1891
SMILES:
N[C@@H](Cc1ccccc1)C(O)=O
: