Target
Coagulation factor VII
Ligand
BDBM50068991
Substrate
Meas. Tech.
ChEMBL_1466580 (CHEMBL3407173)
Ki
37±n/a nM
Citation
 Glunz, PWCheng, XCheney, DLWeigelt, CAWei, ALuettgen, JMWong, PCWexler, RRPriestley, ES Design and synthesis of potent, selective phenylimidazole-based FVIIa inhibitors. Bioorg Med Chem Lett 25:2169-73 (2015)  
Target
Name:
Coagulation factor VII
Synonyms:
Eptacog alfa FA7_HUMAN Factor VIIa (fVIIa) SPCA serum prothrombin conversion accelerator
Type:
Enzyme
Mol. Mass.:
51599.89
Organism:
Homo sapiens (Human)
Description:
Residue:
466
  
Inhibitor
Name:
BDBM50068991
Synonyms:
CHEMBL3403472
Type:
Small organic molecule
Emp. Form.:
C29H32FN5O2
Mol. Mass.:
501.5951
SMILES:
CCOc1cc(OC(C)C)c(F)c(c1)C(Nc1ccc(cc1)C(N)=N)c1nc(c[nH]1)-c1cccc(C)c1
: