Target
Coagulation factor VII
Ligand
BDBM50069008
Substrate
Meas. Tech.
ChEMBL_1466580 (CHEMBL3407173)
Ki
49±n/a nM
Citation
 Glunz, PWCheng, XCheney, DLWeigelt, CAWei, ALuettgen, JMWong, PCWexler, RRPriestley, ES Design and synthesis of potent, selective phenylimidazole-based FVIIa inhibitors. Bioorg Med Chem Lett 25:2169-73 (2015)  
Target
Name:
Coagulation factor VII
Synonyms:
Eptacog alfa FA7_HUMAN Factor VIIa (fVIIa) SPCA serum prothrombin conversion accelerator
Type:
Enzyme
Mol. Mass.:
51599.89
Organism:
Homo sapiens (Human)
Description:
Residue:
466
  
Inhibitor
Name:
BDBM50069008
Synonyms:
CHEMBL3403461
Type:
Small organic molecule
Emp. Form.:
C20H24FN7O2
Mol. Mass.:
413.4487
SMILES:
CCOc1cc(OC(C)C)c(F)c(c1)C(Nc1ccc(cc1)C(N)=N)c1nnn[nH]1
: