Target
Coagulation factor VII
Ligand
BDBM50440849
Substrate
Meas. Tech.
ChEMBL_1466589 (CHEMBL3407182)
Ki
1.000000±n/a nM
Citation
 Glunz, PWCheng, XCheney, DLWeigelt, CAWei, ALuettgen, JMWong, PCWexler, RRPriestley, ES Design and synthesis of potent, selective phenylimidazole-based FVIIa inhibitors. Bioorg Med Chem Lett 25:2169-73 (2015)  
Target
Name:
Coagulation factor VII
Synonyms:
Eptacog alfa FA7_HUMAN Factor VIIa (fVIIa) SPCA serum prothrombin conversion accelerator
Type:
Enzyme
Mol. Mass.:
51599.89
Organism:
Homo sapiens (Human)
Description:
Residue:
466
  
Inhibitor
Name:
BDBM50440849
Synonyms:
CHEMBL2431588
Type:
Small organic molecule
Emp. Form.:
C26H30N4O5S
Mol. Mass.:
510.605
SMILES:
CCOc1cc(ccc1OC(C)C)C(Nc1ccc(cc1)C(N)=N)C(=O)NS(=O)(=O)c1ccccc1
: