Target
Prothrombin
Ligand
BDBM50068983
Substrate
Meas. Tech.
ChEMBL_1466585 (CHEMBL3407178)
Ki
190±n/a nM
Citation
 Glunz, PWCheng, XCheney, DLWeigelt, CAWei, ALuettgen, JMWong, PCWexler, RRPriestley, ES Design and synthesis of potent, selective phenylimidazole-based FVIIa inhibitors. Bioorg Med Chem Lett 25:2169-73 (2015)  
Target
Name:
Prothrombin
Synonyms:
Activation peptide fragment 1 Coagulation factor II Prothrombin precursor Thrombin heavy chain | Thrombin light chain
Type:
Protein
Mol. Mass.:
70029.57
Organism:
Homo sapiens (Human)
Description:
P00734
Residue:
622
  
Inhibitor
Name:
BDBM50068983
Synonyms:
CHEMBL3400183
Type:
Small organic molecule
Emp. Form.:
C29H30FN5O4
Mol. Mass.:
531.578
SMILES:
CCOc1cc(OC(C)C)c(F)c(c1)C(Nc1ccc(cc1)C(N)=N)c1nc(c[nH]1)-c1ccccc1C(O)=O
: