Target
Coagulation factor X
Ligand
BDBM50068991
Substrate
Meas. Tech.
ChEMBL_1466586 (CHEMBL3407179)
Ki
450±n/a nM
Citation
 Glunz, PWCheng, XCheney, DLWeigelt, CAWei, ALuettgen, JMWong, PCWexler, RRPriestley, ES Design and synthesis of potent, selective phenylimidazole-based FVIIa inhibitors. Bioorg Med Chem Lett 25:2169-73 (2015)  
Target
Name:
Coagulation factor X
Synonyms:
Activated coagulation factor X (FXa) Coagulation factor X precursor F10 Factor X heavy chain Factor Xa Stuart-Prower factor
Type:
Enzyme
Mol. Mass.:
54726.60
Organism:
Homo sapiens (Human)
Description:
Residue:
488
  
Inhibitor
Name:
BDBM50068991
Synonyms:
CHEMBL3403472
Type:
Small organic molecule
Emp. Form.:
C29H32FN5O2
Mol. Mass.:
501.5951
SMILES:
CCOc1cc(OC(C)C)c(F)c(c1)C(Nc1ccc(cc1)C(N)=N)c1nc(c[nH]1)-c1cccc(C)c1
: