Target
Serine protease hepsin
Ligand
BDBM50069116
Substrate
Meas. Tech.
ChEMBL_1466699 (CHEMBL3404297)
Ki
2300±n/a nM
Citation
 Franco, FMJones, DEHarris, PKHan, ZWildman, SAJarvis, CMJanetka, JW Structure-based discovery of small molecule hepsin and HGFA protease inhibitors: Evaluation of potency and selectivity derived from distinct binding pockets. Bioorg Med Chem 23:2328-43 (2015)  
Target
Name:
Serine protease hepsin
Synonyms:
HEPS_HUMAN Hepsin TMPRSS1 Transmembrane protease, serine 1
Type:
Enzyme
Mol. Mass.:
45016.98
Organism:
Homo sapiens (Human)
Description:
Human deglycosylated hepsin was expressed in Pichia pastoris.
Residue:
417
  
Inhibitor
Name:
BDBM50069116
Synonyms:
CHEMBL3403530
Type:
Small organic molecule
Emp. Form.:
C30H35N5O5S
Mol. Mass.:
577.694
SMILES:
Cc1ccc(cc1)S(=O)(=O)N[C@@H](Cc1cccc(c1)C(N)=N)C(=O)N1CCC[C@@H](C1)NC(=O)OCc1ccccc1
: