Target
Suppressor of tumorigenicity 14 protein
Ligand
BDBM50069110
Substrate
Meas. Tech.
ChEMBL_1466698 (CHEMBL3404296)
Ki
1500±n/a nM
Citation
 Franco, FMJones, DEHarris, PKHan, ZWildman, SAJarvis, CMJanetka, JW Structure-based discovery of small molecule hepsin and HGFA protease inhibitors: Evaluation of potency and selectivity derived from distinct binding pockets. Bioorg Med Chem 23:2328-43 (2015)  
Target
Name:
Suppressor of tumorigenicity 14 protein
Synonyms:
Epithin MT-SP1 PRSS14 SNC19 ST14_HUMAN Suppressor of tumorigenicity 14 protein TADG15
Type:
Single-pass type II membrane protein
Mol. Mass.:
94769.23
Organism:
Homo sapiens (Human)
Description:
Q9Y5Y6
Residue:
855
  
Inhibitor
Name:
BDBM50069110
Synonyms:
CHEMBL3402437
Type:
Small organic molecule
Emp. Form.:
C33H31N5O4S2
Mol. Mass.:
625.76
SMILES:
NC(=N)c1cccc(C[C@H](NS(=O)(=O)c2ccc3ccccc3c2)C(=O)N2CCN(CC2)C(=O)c2csc3ccccc23)c1
: