Target
Ubiquitin carboxyl-terminal hydrolase 7
Ligand
BDBM50069766
Substrate
Meas. Tech.
ChEMBL_1469484 (CHEMBL3412281)
IC50
22600±n/a nM
Citation
 Ndubaku, CTsui, V Inhibiting the deubiquitinating enzymes (DUBs). J Med Chem 58:1581-95 (2015)  
Target
Name:
Ubiquitin carboxyl-terminal hydrolase 7
Synonyms:
Deubiquitinating enzyme 7 Herpesvirus-associated ubiquitin-specific protease USP7 Ubiquitin-specific-processing protease 7
Type:
PROTEIN
Mol. Mass.:
128274.45
Organism:
Homo sapiens (Human)
Description:
ChEMBL_1469483
Residue:
1102
  
Inhibitor
Name:
BDBM50069766
Synonyms:
CHEMBL3407550
Type:
Small organic molecule
Emp. Form.:
C26H30ClN3O
Mol. Mass.:
435.989
SMILES:
CCN(CCCNC(=O)c1ccc2c(Cl)c3CCCCc3nc2c1)Cc1ccccc1
: