Target
Cytochrome P450 1A2
Ligand
BDBM50069812
Substrate
Meas. Tech.
ChEMBL_1469954 (CHEMBL3414381)
IC50
>10000±n/a nM
Citation
 Tosh, DKFinley, APaoletta, SMoss, SMGao, ZGGizewski, ETAuchampach, JASalvemini, DJacobson, KA In vivo phenotypic screening for treating chronic neuropathic pain: modification of C2-arylethynyl group of conformationally constrained A3 adenosine receptor agonists. J Med Chem 57:9901-14 (2014)  
Target
Name:
Cytochrome P450 1A2
Synonyms:
CP1A2_HUMAN CYPIA2 Cytochrome P(3)450 Cytochrome P450 1A2 (CYP1A2) Cytochrome P450-P3
Type:
Enzyme
Mol. Mass.:
58423.38
Organism:
Homo sapiens (Human)
Description:
P05177
Residue:
516
  
Inhibitor
Name:
BDBM50069812
Synonyms:
CHEMBL3407784
Type:
Small organic molecule
Emp. Form.:
C20H19ClN6O3S
Mol. Mass.:
458.921
SMILES:
[H][C@]12C[C@]1([C@@H](O)[C@@H](O)[C@@H]2n1cnc2c(NC)nc(nc12)C#Cc1ccc(Cl)s1)C(=O)NC
: