Target
Adenosine receptor A3
Ligand
BDBM50389131
Substrate
Meas. Tech.
ChEMBL_1469768 (CHEMBL3413619)
Ki
58±n/a nM
Citation
 Tosh, DKFinley, APaoletta, SMoss, SMGao, ZGGizewski, ETAuchampach, JASalvemini, DJacobson, KA In vivo phenotypic screening for treating chronic neuropathic pain: modification of C2-arylethynyl group of conformationally constrained A3 adenosine receptor agonists. J Med Chem 57:9901-14 (2014)  
Target
Name:
Adenosine receptor A3
Synonyms:
A3AR Adenosine A3 receptor Gpcr2
Type:
PROTEIN
Mol. Mass.:
36460.91
Organism:
Mus musculus
Description:
ChEMBL_1515686
Residue:
319
  
Inhibitor
Name:
BDBM50389131
Synonyms:
CHEMBL2064636
Type:
Small organic molecule
Emp. Form.:
C21H21N7O3
Mol. Mass.:
419.4365
SMILES:
CNC(=O)[C@@]12C[C@@H]1[C@H]([C@H](O)[C@@H]2O)n1cnc2c(NC)nc(nc12)C#Cc1ccccn1
: