Target
Phosphatidylinositol 4,5-bisphosphate 3-kinase catalytic subunit delta isoform
Ligand
BDBM119288
Substrate
Meas. Tech.
ChEMBL_1467021 (CHEMBL3411218)
IC50
62±n/a nM
Citation
 Barlaam, BCosulich, SDegorce, SFitzek, MGreen, SHancox, ULambert-van der Brempt, CLohmann, JJMaudet, MMorgentin, RPasquet, MJPéru, APlé, PSaleh, TVautier, MWalker, MWard, LWarin, N Discovery of (R)-8-(1-(3,5-difluorophenylamino)ethyl)-N,N-dimethyl-2-morpholino-4-oxo-4H-chromene-6-carboxamide (AZD8186): a potent and selective inhibitor of PI3Kß and PI3Kd for the treatment of PTEN-deficient cancers. J Med Chem 58:943-62 (2015)  
Target
Name:
Phosphatidylinositol 4,5-bisphosphate 3-kinase catalytic subunit delta isoform
Synonyms:
PI3-kinase p110 subunit delta PI3-kinase subunit p110-delta PIK3CD Phosphatidylinositol 4,5-biphosphate 3-kinase catalytic subunit delta (PIK3CD) Phosphatidylinositol 4,5-bisphosphate 3-kinase 110 kDa catalytic subunit delta (PI3K delta) Phosphatidylinositol 4,5-bisphosphate 3-kinase catalytic subunit delta (PI3Kdelta) Phosphatidylinositol 4,5-bisphosphate 3-kinase catalytic subunit delta isoform (PI3K delta) Phosphatidylinositol 4,5-bisphosphate 3-kinase catalytic subunit delta isoform (PI3K-delta) Phosphatidylinositol 4,5-bisphosphate 3-kinase catalytic subunit delta isoform (PI3Kdelta)
Type:
Enzyme Subunit
Mol. Mass.:
119489.41
Organism:
Homo sapiens (Human)
Description:
O00329
Residue:
1044
  
Inhibitor
Name:
BDBM119288
Synonyms:
US8673906, 4.07 | US9718800, 4.07
Type:
Small organic molecule
Emp. Form.:
C25H27F2N3O5
Mol. Mass.:
487.4958
SMILES:
CC(Nc1cc(F)cc(F)c1)c1cc(cc2c1oc(cc2=O)N1CCOCC1)C(=O)N(C)CCO
: