Target
5-hydroxytryptamine receptor 1A
Ligand
BDBM86708
Substrate
Meas. Tech.
ChEMBL_1468779 (CHEMBL3414318)
IC50
4.9±n/a nM
Citation
 Kolaczkowski, MMarcinkowska, MBucki, ASniecikowska, JPawlowski, MKazek, GSiwek, AJastrzebska-Wiesek, MPartyka, AWasik, AWesolowska, AMierzejewski, PBienkowski, P Novel 5-HT6 receptor antagonists/D2 receptor partial agonists targeting behavioral and psychological symptoms of dementia. Eur J Med Chem 92:221-35 (2015)  
Target
Name:
5-hydroxytryptamine receptor 1A
Synonyms:
5-HT-1A 5-hydroxytryptamine receptor 1A (5-HT-1A) ADRB2RL1 Dopamine D2 receptor and serotonin 1a receptor HTR1A | Serotonin receptor 1A
Type:
Mol. Mass.:
46122.49
Organism:
Homo sapiens (Human)
Description:
Residue:
422
  
Inhibitor
Name:
BDBM86708
Synonyms:
CAS_146714-97-8 CHEMBL514874 NSC_104911 | WAY 100,635
Type:
Small organic molecule
Emp. Form.:
C25H34N4O2
Mol. Mass.:
422.5631
SMILES:
COc1ccccc1N1CCN(CCN(C(=O)C2CCCCC2)c2ccccn2)CC1
: