Target
Bromodomain-containing protein 4
Ligand
BDBM50071105
Substrate
Meas. Tech.
ChEMBL_1469310 (CHEMBL3414207)
IC50
60±n/a nM
Citation
 Zhao, LWang, YCao, DChen, TWang, QLi, YXu, YZhang, NWang, XChen, DChen, LChen, YLXia, GShi, ZLiu, YCLin, YMiao, ZShen, JXiong, B Fragment-based drug discovery of 2-thiazolidinones as BRD4 inhibitors: 2. Structure-based optimization. J Med Chem 58:1281-97 (2015)  
Target
Name:
Bromodomain-containing protein 4
Synonyms:
BRD4 Bromodomain-containing protein 4 (BRD4) Protein HUNK1
Type:
Protein
Mol. Mass.:
152264.84
Organism:
Homo sapiens (Human)
Description:
O60885
Residue:
1362
  
Inhibitor
Name:
BDBM50071105
Synonyms:
CHEMBL3410003
Type:
Small organic molecule
Emp. Form.:
C18H21N3O4S2
Mol. Mass.:
407.507
SMILES:
O=C(Nc1cc(cc(c1)S(=O)(=O)NC1CCCC1)-c1csc(=O)[nH]1)C1CC1
: