Target
Bromodomain-containing protein 4
Ligand
BDBM50365463
Substrate
Meas. Tech.
ChEMBL_1469309 (CHEMBL3414206)
IC50
630±n/a nM
Citation
 Zhao, LWang, YCao, DChen, TWang, QLi, YXu, YZhang, NWang, XChen, DChen, LChen, YLXia, GShi, ZLiu, YCLin, YMiao, ZShen, JXiong, B Fragment-based drug discovery of 2-thiazolidinones as BRD4 inhibitors: 2. Structure-based optimization. J Med Chem 58:1281-97 (2015)  
Target
Name:
Bromodomain-containing protein 4
Synonyms:
BRD4 Bromodomain-containing protein 4 (BRD4) Protein HUNK1
Type:
Protein
Mol. Mass.:
152264.84
Organism:
Homo sapiens (Human)
Description:
O60885
Residue:
1362
  
Inhibitor
Name:
BDBM50365463
Synonyms:
CHEMBL1232461
Type:
Small organic molecule
Emp. Form.:
C22H22ClN5O2
Mol. Mass.:
423.895
SMILES:
CCNC(=O)C[C@@H]1N=C(c2ccc(Cl)cc2)c2cc(OC)ccc2-n2c(C)nnc12
: