Target
Carbonic anhydrase 1
Ligand
BDBM50071814
Substrate
Meas. Tech.
ChEMBL_1467067 (CHEMBL3411264)
Ki
87±n/a nM
Citation
 Tanpure, RPRen, BPeat, TSBornaghi, LFVullo, DSupuran, CTPoulsen, SA Carbonic anhydrase inhibitors with dual-tail moieties to match the hydrophobic and hydrophilic halves of the carbonic anhydrase active site. J Med Chem 58:1494-501 (2015)  
Target
Name:
Carbonic anhydrase 1
Synonyms:
CA-I CAB Carbonate dehydratase I Carbonic anhydrase 1 (CA I) Carbonic anhydrase 1 (Recombinant CA I) Carbonic anhydrase B Carbonic anhydrase I (CA I) Carbonic anhydrase I (CAI) Carbonic anhydrase isoenzyme I (hCA I) | hCA
Type:
Enzyme
Mol. Mass.:
28873.37
Organism:
Homo sapiens (Human)
Description:
P00915
Residue:
261
  
Inhibitor
Name:
BDBM50071814
Synonyms:
CHEMBL3410763
Type:
Small organic molecule
Emp. Form.:
C11H17N7O8S2
Mol. Mass.:
439.425
SMILES:
NS(=O)(=O)c1nnc(NCc2cn(O[C@@H]3O[C@H](CO)[C@@H](O)[C@H](O)[C@H]3O)nn2)s1
: