Target
eIF-2-alpha kinase GCN2
Ligand
BDBM50072026
Substrate
Meas. Tech.
ChEMBL_1467741 (CHEMBL3412167)
IC50
10.0±n/a nM
Citation
 Smith, ALAndrews, KLBeckmann, HBellon, SFBeltran, PJBooker, SChen, HChung, YAD'Angelo, NDDao, JDellamaggiore, KRJaeckel, PKendall, RLabitzke, KLong, AMMaterna-Reichelt, SMitchell, PNorman, MHPowers, DRose, MShaffer, PLWu, MMLipford, JR Discovery of 1H-pyrazol-3(2H)-ones as potent and selective inhibitors of protein kinase R-like endoplasmic reticulum kinase (PERK). J Med Chem 58:1426-41 (2015)  
Target
Name:
eIF-2-alpha kinase GCN2
Synonyms:
E2AK4_HUMAN Eukaryotic translation initiation factor 2-alpha kinase 4 GCN2(Kin.Dom.2 S808G) KIAA1338
Type:
PROTEIN
Mol. Mass.:
186899.26
Organism:
Homo sapiens (Human)
Description:
ChEMBL_1495738
Residue:
1649
  
Inhibitor
Name:
BDBM50072026
Synonyms:
CHEMBL3407851
Type:
Small organic molecule
Emp. Form.:
C32H24ClN5O3
Mol. Mass.:
562.018
SMILES:
CNc1ncc2ccc(Oc3cc(ccc3Cl)C(=O)c3c(-c4ccccc4)n(C)n(-c4ccccc4)c3=O)cc2n1
: