Target
Serine/threonine-protein kinase B-raf
Ligand
BDBM50072074
Substrate
Meas. Tech.
ChEMBL_1467747 (CHEMBL3412173)
IC50
11±n/a nM
Citation
 Smith, ALAndrews, KLBeckmann, HBellon, SFBeltran, PJBooker, SChen, HChung, YAD'Angelo, NDDao, JDellamaggiore, KRJaeckel, PKendall, RLabitzke, KLong, AMMaterna-Reichelt, SMitchell, PNorman, MHPowers, DRose, MShaffer, PLWu, MMLipford, JR Discovery of 1H-pyrazol-3(2H)-ones as potent and selective inhibitors of protein kinase R-like endoplasmic reticulum kinase (PERK). J Med Chem 58:1426-41 (2015)  
Target
Name:
Serine/threonine-protein kinase B-raf
Synonyms:
B-RAF B-Raf proto-oncogene serine/threonine-protein kinase BRAF1 RAFB1 v-Raf murine sarcoma viral oncogene homolog B1
Type:
Serine/threonine-protein kinase
Mol. Mass.:
84446.00
Organism:
Homo sapiens (Human)
Description:
P15056
Residue:
766
  
Inhibitor
Name:
BDBM50072074
Synonyms:
CHEMBL3407847
Type:
Small organic molecule
Emp. Form.:
C25H22F3N5O2
Mol. Mass.:
481.4697
SMILES:
CNc1ncc2cc(ccc2n1)-c1c(C)ccc(C(=O)Nc2ccc(OC)c(c2)C(F)(F)F)c1N
: