Target
Eukaryotic translation initiation factor 2-alpha kinase 3
Ligand
BDBM50072075
Substrate
Meas. Tech.
ChEMBL_1467749 (CHEMBL3412175)
IC50
20±n/a nM
Citation
 Smith, ALAndrews, KLBeckmann, HBellon, SFBeltran, PJBooker, SChen, HChung, YAD'Angelo, NDDao, JDellamaggiore, KRJaeckel, PKendall, RLabitzke, KLong, AMMaterna-Reichelt, SMitchell, PNorman, MHPowers, DRose, MShaffer, PLWu, MMLipford, JR Discovery of 1H-pyrazol-3(2H)-ones as potent and selective inhibitors of protein kinase R-like endoplasmic reticulum kinase (PERK). J Med Chem 58:1426-41 (2015)  
Target
Name:
Eukaryotic translation initiation factor 2-alpha kinase 3
Synonyms:
E2AK3_HUMAN HsPEK PERK Pancreatic endoplasmic reticulum kinase (PERK)
Type:
Enzyme
Mol. Mass.:
125190.66
Organism:
Homo sapiens (Human)
Description:
Q9NZJ5
Residue:
1116
  
Inhibitor
Name:
BDBM50072075
Synonyms:
CHEMBL3407846
Type:
Small organic molecule
Emp. Form.:
C24H19F4N5O
Mol. Mass.:
469.4342
SMILES:
Cn1cc(-c2ccc3N(CC(=O)c4cc(F)cc(c4)C(F)(F)F)CCc3c2)c2c(N)ncnc12
: