Target
Kappa-type opioid receptor
Ligand
BDBM50072345
Substrate
Meas. Tech.
ChEMBL_1469045 (CHEMBL3413015)
Ki
147±n/a nM
Citation
 Iyer, MRRothman, RBDersch, CMJacobson, AERice, KC Probes for narcotic receptor mediated phenomena 49. N-substituted rac-cis-4a-arylalkyl-1,2,3,4,4a,9a-hexahydrobenzofuro[2,3-c]pyridin-6-ols. Eur J Med Chem 92:531-9 (2015)  
Target
Name:
Kappa-type opioid receptor
Synonyms:
K-OR-1 Kappa-opioid receptor (KOR) Kappa-type opioid receptor (KOR) OPIATE Kappa OPRK1 kappa opioid receptor (KOR)
Type:
G Protein-Coupled Receptor (GPCR)
Mol. Mass.:
42648.76
Organism:
Homo sapiens (Human)
Description:
P41145
Residue:
380
  
Inhibitor
Name:
BDBM50072345
Synonyms:
CHEMBL3409110
Type:
Small organic molecule
Emp. Form.:
C29H32FNO2
Mol. Mass.:
445.5683
SMILES:
[H][C@]12CN(CCc3ccc(F)cc3)CC[C@@]1(CCCCc1ccccc1)c1cc(O)ccc1O2
: