Target
Histone-lysine N-methyltransferase EHMT1
Ligand
BDBM50396024
Substrate
Meas. Tech.
ChEMBL_1473119 (CHEMBL3421448)
IC50
100±n/a nM
Citation
 Kaniskan, HÜKonze, KDJin, J Selective inhibitors of protein methyltransferases. J Med Chem 58:1596-629 (2015)  
Target
Name:
Histone-lysine N-methyltransferase EHMT1
Synonyms:
EHMT1 EUHMTASE1 Euchromatic histone-lysine N-methyltransferase 1 GLP H3-K9-HMTase 5 Histone-lysine N-methyltransferase EHMT1/EHMT2 KMT1D | Lysine N-methyltransferase 1D
Type:
PROTEIN
Mol. Mass.:
141443.67
Organism:
Homo sapiens (Human)
Description:
ChEMBL_1450367
Residue:
1298
  
Inhibitor
Name:
BDBM50396024
Synonyms:
CHEMBL1232453
Type:
Small organic molecule
Emp. Form.:
C29H52N8O2
Mol. Mass.:
544.7756
SMILES:
COc1cc2c(NC3CCN(CCCCCN)CC3)nc(NCCCN(C)C)nc2cc1OCCCCCN
: