Target
Histone-lysine N-methyltransferase EZH2
Ligand
BDBM50075074
Substrate
Meas. Tech.
ChEMBL_1473225 (CHEMBL3418470)
IC50
17±n/a nM
Citation
 Kaniskan, HÜKonze, KDJin, J Selective inhibitors of protein methyltransferases. J Med Chem 58:1596-629 (2015)  
Target
Name:
Histone-lysine N-methyltransferase EZH2
Synonyms:
ENX-1 EZH2_HUMAN Histone-lysine N-methyltransferase EZH2 Lysine N-methyltransferase 6
Type:
Protein
Mol. Mass.:
85367.84
Organism:
Homo sapiens (Human)
Description:
Q15910
Residue:
746
  
Inhibitor
Name:
BDBM50075074
Synonyms:
CHEMBL3414629
Type:
Small organic molecule
Emp. Form.:
C67H104N10O17S
Mol. Mass.:
1353.664
SMILES:
[H][C@]12CS[C@@H](CCCCC(=O)NCCOCCOCCOCCOCCOCCOCCOCCOCCOCCOCCOCCOCCC(=O)N3CCN(CC3)c3ccc(cn3)-c3cc(C(=O)NCc4c(CCC)cc(C)[nH]c4=O)c4cnn(C(C)C)c4c3)[C@@]1([H])NC(=O)N2
: