Target
N-lysine methyltransferase KMT5A
Ligand
BDBM50075099
Substrate
Meas. Tech.
ChEMBL_1473626 (CHEMBL3420965)
IC50
700±n/a nM
Citation
 Kaniskan, HÜKonze, KDJin, J Selective inhibitors of protein methyltransferases. J Med Chem 58:1596-629 (2015)  
Target
Name:
N-lysine methyltransferase KMT5A
Synonyms:
KMT5A N-lysine methyltransferase SETD8 SET domain-containing protein 8 (SetD8) SET8 | SETD8
Type:
Enzyme
Mol. Mass.:
42919.11
Organism:
Homo sapiens (Human)
Description:
Q9NQR1
Residue:
393
  
Inhibitor
Name:
BDBM50075099
Synonyms:
CHEMBL580421 | TCMDC-124224
Type:
Small organic molecule
Emp. Form.:
C14H11NO3
Mol. Mass.:
241.242
SMILES:
CC1(C)C(=O)N=C2C1=C(O)C(=O)c1ccccc21
: