Target
Aldehyde dehydrogenase 1A1
Ligand
BDBM50076743
Substrate
Meas. Tech.
ChEMBL_1473164 (CHEMBL3418216)
IC50
3100±n/a nM
Citation
 Morgan, CAHurley, TD Characterization of two distinct structural classes of selective aldehyde dehydrogenase 1A1 inhibitors. J Med Chem 58:1964-75 (2015)  
Target
Name:
Aldehyde dehydrogenase 1A1
Synonyms:
AL1A1_HUMAN ALDH-E1 ALDH1A1 Aldehyde dehydrogenase 1A1 (ALDH1A1) Aldehyde dehydrogenase family 1 member A1 (ALDH1A1) PUMB1 RalDH1 | Retinal dehydrogenase 1
Type:
Protein
Mol. Mass.:
54862.21
Organism:
Homo sapiens (Human)
Description:
Residue:
501
  
Inhibitor
Name:
BDBM50076743
Synonyms:
CHEMBL1527610
Type:
Small organic molecule
Emp. Form.:
C11H11NO3S
Mol. Mass.:
237.275
SMILES:
COc1ccc(cc1OC)C(=O)CSC#N
: