Target
Sodium channel protein type 9 subunit alpha
Ligand
BDBM50077471
Substrate
Meas. Tech.
ChEMBL_1473387 (CHEMBL3419347)
IC50
3.6±n/a nM
Citation
 Murray, JKLigutti, JLiu, DZou, APoppe, LLi, HAndrews, KLMoyer, BDMcDonough, SIFavreau, PStöcklin, RMiranda, LP Engineering potent and selective analogues of GpTx-1, a tarantula venom peptide antagonist of the Na(V)1.7 sodium channel. J Med Chem 58:2299-314 (2015)  
Target
Name:
Sodium channel protein type 9 subunit alpha
Synonyms:
Kiaa4197 Peripheral sodium channel 1 Scn9a Sodium channel protein type IX subunit alpha | Voltage-gated sodium channel subunit alpha Nav1.7
Type:
PROTEIN
Mol. Mass.:
225808.99
Organism:
Mus musculus
Description:
ChEMBL_109594
Residue:
1984
  
Inhibitor
Name:
BDBM50077471
Synonyms:
CHEMBL3416886
Type:
Small organic molecule
Emp. Form.:
C176H271N53O45S7
Mol. Mass.:
4073.818
SMILES:
[H][C@@]12CCCN1C(=O)[C@H](CCCNC(N)=N)NC(=O)[C@]1([H])CSSC[C@H](NC(=O)[C@@H](N)CC(O)=O)C(=O)N[C@@H](CC(C)C)C(=O)NCC(=O)N[C@@H](Cc3ccccc3)C(=O)N[C@@H](CCSC)C(=O)N[C@@H](CCCNC(N)=N)C(=O)N[C@@H](CCCCN)C(=O)N[C@@]3([H])CSSC[C@]([H])(NC(=O)[C@@H](NC(=O)[C@H](CC(C)C)NC(=O)[C@H](CC(N)=O)NC2=O)C(C)C)C(=O)N[C@@H](CO)C(=O)N[C@@H](CCCNC(N)=N)C(=O)N[C@@]([H])([C@@H](C)O)C(=O)N[C@@H](Cc2cnc[nH]2)C(=O)N[C@@H](CCCCN)C(=O)N[C@@H](Cc2c[nH]c4ccccc24)C(=O)N[C@@H](CSSC[C@]([H])(NC(=O)[C@H](CCCCN)NC(=O)[C@H](CC(O)=O)NC(=O)[C@H](CC(N)=O)NC(=O)[C@H](CC(O)=O)NC(=O)[C@]2([H])CCCN2C(=O)[C@@]([H])(NC3=O)[C@@H](C)CC)C(=O)N1)C(=O)N[C@@H](CCCCN)C(=O)N[C@@H](Cc1ccc(O)cc1)C(=O)N[C@@H](C(C)C)C(=O)N[C@@H](Cc1ccccc1)C(N)=O
: