Target
Apelin receptor
Ligand
BDBM50078009
Substrate
Meas. Tech.
ChEMBL_1471752 (CHEMBL3421344)
IC50
14±n/a nM
Citation
 Murza, ABesserer-Offroy, ÉCôté, JBérubé, PLongpré, JMDumaine, RLesur, OAuger-Messier, MLeduc, RSarret, PMarsault, É C-Terminal modifications of apelin-13 significantly change ligand binding, receptor signaling, and hypotensive action. J Med Chem 58:2431-40 (2015)  
Target
Name:
Apelin receptor
Synonyms:
AGTRL1 APJ_HUMAN Angiotensin receptor-like 1 Apelin receptor (APJ) G-protein coupled receptor HG11
Type:
Enzyme Catalytic Domain
Mol. Mass.:
42664.06
Organism:
Homo sapiens (Human)
Description:
P35414
Residue:
380
  
Inhibitor
Name:
BDBM50078009
Synonyms:
CHEMBL3417382
Type:
Small organic molecule
Emp. Form.:
C69H108N22O16
Mol. Mass.:
1501.7336
SMILES:
CCCC[C@H](NC(=O)[C@@H]1CCCN1C(=O)CNC(=O)[C@H](CCCCN)NC(=O)[C@H](Cc1cnc[nH]1)NC(=O)[C@H](CO)NC(=O)[C@H](CC(C)C)NC(=O)[C@H](CCCNC(N)=N)NC(=O)[C@@H]1CCCN1C(=O)[C@H](CCCNC(N)=N)NC(=O)[C@@H]1CCC(=O)N1)C(=O)N1CCC[C@H]1C(=O)N[C@H](C(O)=O)c1ccccc1
: