Target
Biotin--protein ligase
Ligand
BDBM50039492
Substrate
Meas. Tech.
ChEMBL_1475435 (CHEMBL3424428)
Ki
182±n/a nM
Citation
 Tieu, WPolyak, SWPaparella, ASYap, MYSoares da Costa, TPNg, BWang, GLumb, RBell, JMTurnidge, JDWilce, MCBooker, GWAbell, AD Improved Synthesis of Biotinol-5'-AMP: Implications for Antibacterial Discovery. ACS Med Chem Lett 6:216-20 (2015)  
Target
Name:
Biotin--protein ligase
Synonyms:
BPL1_HUMAN Biotin--[acetyl-CoA-carboxylase] ligase Biotin--[methylmalonyl-CoA-carboxytransferase] ligase HCS Holocarboxylase synthetase
Type:
PROTEIN
Mol. Mass.:
80745.43
Organism:
Homo sapiens (Human)
Description:
ChEMBL_1475435
Residue:
726
  
Inhibitor
Name:
BDBM50039492
Synonyms:
CHEMBL1231498
Type:
Small organic molecule
Emp. Form.:
C20H30N7O8PS
Mol. Mass.:
559.533
SMILES:
Nc1ncnc2n(cnc12)[C@@H]1O[C@H](CO[P@@](O)(=O)OCCCCC[C@@H]2SC[C@@H]3NC(=O)N[C@H]23)[C@@H](O)[C@H]1O
: