Target
Cytochrome P450 1A1
Ligand
BDBM50014323
Substrate
Meas. Tech.
ChEMBL_1474527 (CHEMBL3423816)
IC50
12±n/a nM
Citation
 Cui, JMeng, QZhang, XCui, QZhou, WLi, S Design and Synthesis of Newa-Naphthoflavones as Cytochrome P450 (CYP) 1B1 Inhibitors To Overcome Docetaxel-Resistance Associated with CYP1B1 Overexpression. J Med Chem 58:3534-47 (2015)  
Target
Name:
Cytochrome P450 1A1
Synonyms:
CP1A1_HUMAN CYPIA1 Cytochrome P450 1A1 P450 form 6 P450-P1
Type:
Protein
Mol. Mass.:
58177.23
Organism:
Homo sapiens (Human)
Description:
P04798
Residue:
512
  
Inhibitor
Name:
BDBM50014323
Synonyms:
2-PHENYL-4H-BENZO[H]CHROMEN-4-ONE 7,8-Benzoflavone alpha-naphthoflavone
Type:
Small organic molecule
Emp. Form.:
C19H12O2
Mol. Mass.:
272.2974
SMILES:
O=c1cc(oc2c3ccccc3ccc12)-c1ccccc1
: