Target
KiSS-1 receptor
Ligand
BDBM50082072
Substrate
Meas. Tech.
ChEMBL_1474616 (CHEMBL3423932)
EC50
>500±n/a nM
Citation
 Beltramo, MRobert, VGalibert, MMadinier, JBMarceau, PDardente, HDecourt, CDe Roux, NLomet, DDelmas, AFCaraty, AAucagne, V Rational design of triazololipopeptides analogs of kisspeptin inducing a long-lasting increase of gonadotropins. J Med Chem 58:3459-70 (2015)  
Target
Name:
KiSS-1 receptor
Synonyms:
AXOR12 G-protein coupled receptor 54 (GPR54) Hypogonadotropin-1 KISSR_HUMAN Kisspeptins receptor hOT7T175
Type:
G Protein-Coupled Receptor (GPCR)
Mol. Mass.:
42613.79
Organism:
Homo sapiens (Human)
Description:
Binding assay was performed using membranes from the CHO cell transfectants.
Residue:
398
  
Inhibitor
Name:
BDBM50082072
Synonyms:
CHEMBL3422513
Type:
Small organic molecule
Emp. Form.:
C76H117N17O17
Mol. Mass.:
1540.8459
SMILES:
CCCCCCCCCCCCCCCC(=O)NCCCC[C@H](NC(=O)[C@H](CC(N)=O)NC(=O)[C@H](Cc1ccc(O)cc1)NC(C)=O)C(=O)N[C@@H](CC(N)=O)C(=O)N[C@@H](CO)C(=O)N[C@@H](Cc1ccccc1)C(=O)NCC(=O)N[C@@H](CC(C)C)C(=O)N[C@@H](CCCNC(N)=N)C(=O)N[C@@H](Cc1ccc(O)cc1)C(N)=O
: