Target
Potassium voltage-gated channel subfamily H member 2
Ligand
BDBM50082387
Substrate
Meas. Tech.
ChEMBL_1475692 (CHEMBL3424851)
IC50
3.3±n/a nM
Citation
 Singh, SBKaelin, DEWu, JMiesel, LTan, CMMeinke, PTOlsen, DBLagrutta, AWei, CPeng, XWang, XFukuda, HKishii, RTakei, MShibata, TOhata, KTakano, HKurasaki, HTakeuchi, TNishimura, AFukuda, Y Structure activity relationship of substituted 1,5-naphthyridine analogs of oxabicyclooctane-linked novel bacterial topoisomerase inhibitors as broad-spectrum antibacterial agents (Part-4). Bioorg Med Chem Lett 25:2409-15 (2015)  
Target
Name:
Potassium voltage-gated channel subfamily H member 2
Synonyms:
1,3-beta-glucan synthase component GLS2 ERG Eag-related protein 1 Ether-a-go-go-related gene (HERG) Ether-a-go-go-related gene potassium channel 1 Ether-a-go-go-related gene potassium channel 1 (hERG1) Ether-a-go-go-related protein 1 H-ERG KCNH2 Potassium voltage-gated channel subfamily H member 2 (hERG) Voltage-gated potassium channel subunit Kv11.1 hERG Potassium Channel 1 | putative potassium channel subunit
Type:
Multi-pass membrane protein
Mol. Mass.:
126672.65
Organism:
Homo sapiens (Human)
Description:
Q12809
Residue:
1159
  
Inhibitor
Name:
BDBM50082387
Synonyms:
CHEMBL3422961
Type:
Small organic molecule
Emp. Form.:
C25H25ClFN5O3
Mol. Mass.:
497.949
SMILES:
Fc1cnc2cc(Cl)cnc2c1CCC12CCC(CC1)(CO2)NCc1ccc2OCC(=O)Nc2n1
: